{"text_format":"1","workbook":"xlsx","n_sheets":12,"sheets":["DatosBasicos","Departamentos","EntidadesTerritoriales","DAF_BalanceFinanciero","DAF_Ley358","DAF_SaldoDeuda","Entidad","Descripción Glosario","Supuestos Macro Nación","Plan Financiero","Superávit Primario","Capacidad de Endeudamiento"],"not_rendered":{"charts":0,"images":6,"macros":0,"external_links":4,"defined_names":113,"comments":2,"pivot_tables":0},"unopened":[],"bounds":{"document_bytes":16777216,"sheet_cells":100000,"rows_first":2000,"rows_last":500,"rows_between":2000,"halvings":0,"cell_chars":16384,"cell_head_chars":4096},"cells_cut":0,"cells_raw":0,"read":"whole","date_system":"1900"}

{"sheet":"DatosBasicos","index":0,"n_rows":11,"n_cols":4,"rows_kept":11,"cut":false,"hidden":true,"merged":[]}
["AÑO","DEPARTAMENTO","CORTE"]
[2021,"MAGDALENA"]
["SI"]
["NO",null,null,"% DE ICLD CONTRALORIAS DPTALES"]
["E","E",null,1.2E-2]
[1,1,null,0.02]
[2,2,null,2.5000000000000001E-2]
[3,3,null,0.03]
[4,4,null,0.03]
[null,5]
{"$rows_left_out":2}
{"sheet":"Departamentos","index":1,"n_rows":33,"n_cols":2,"rows_kept":33,"cut":false,"hidden":true,"merged":[]}
["NOMBRE_DEPARTAMENTO","CODIGO_DIVIPOLA_DEPARTAMENTO"]
["AMAZONAS",91000]
["ANTIOQUIA",5000]
["ARAUCA",81000]
["ATLANTICO",8000]
["BOLIVAR",13000]
["BOYACA",15000]
["CALDAS",17000]
["CAQUETA",18000]
["CASANARE",85000]
{"$rows_left_out":24}
{"sheet":"EntidadesTerritoriales","index":2,"n_rows":1134,"n_cols":5,"rows_kept":1134,"cut":false,"hidden":true,"merged":[]}
["CONCATENACION","DEPARTAMENTO","CODIGO_DIVIPOLA_ENTIDAD","NOMBRE_ENTIDAD","CATEGORIA"]
[{"$f":"B2&\"-\"&D2","v":"AMAZONAS-DEPARTAMENTO DEL AMAZONAS"},"AMAZONAS",91000,"DEPARTAMENTO DEL AMAZONAS","4"]
[{"$f":"B3&\"-\"&D3","v":"AMAZONAS-LETICIA"},"AMAZONAS",91001,"LETICIA","5"]
["AMAZONAS-PUERTO NARIÑO","AMAZONAS",91540,"PUERTO NARIÑO","6"]
["ANTIOQUIA-ABEJORRAL","ANTIOQUIA",5002,"ABEJORRAL","6"]
["ANTIOQUIA-ABRIAQUÍ","ANTIOQUIA",5004,"ABRIAQUÍ","6"]
["ANTIOQUIA-ALEJANDRÍA","ANTIOQUIA",5021,"ALEJANDRÍA","6"]
["ANTIOQUIA-AMAGÁ","ANTIOQUIA",5030,"AMAGÁ","6"]
["ANTIOQUIA-AMALFI","ANTIOQUIA",5031,"AMALFI","6"]
["ANTIOQUIA-ANDES","ANTIOQUIA",5034,"ANDES","6"]
{"$rows_left_out":1125}
{"sheet":"DAF_BalanceFinanciero","index":3,"n_rows":2299,"n_cols":9,"rows_kept":2299,"cut":false,"hidden":true,"merged":[]}
["CONCATENACION","DEPARTAMENTO","CODIGO_DIVIPOLA_ENTIDAD","NOMBRE_ENTIDAD","ORDEN","CODIGO_CONCEPTO_BF","NOMBRE_CONCEPTO_BF",{"$f":"\"TOTAL_\"&DatosBasicos!A2-2","v":"TOTAL_2019"},{"$f":"\"TOTAL_\"&DatosBasicos!A2-1","v":"TOTAL_2020"}]
[{"$f":"C2&\"-\"&F2","v":"47000-BF_1"},"MAGDALENA",47000,"DEPARTAMENTO DEL MAGDALENA",1,"BF_1","INGRESOS TOTALES",1029084.1525279999,1030817.15071]
["47000-BF_1.1","MAGDALENA",47000,"DEPARTAMENTO DEL MAGDALENA",2,"BF_1.1","    INGRESOS CORRIENTES",974549.37596099998,968351.98533699999]
["47000-BF_1.1.1","MAGDALENA",47000,"DEPARTAMENTO DEL MAGDALENA",3,"BF_1.1.1","        TRIBUTARIOS",205644.25159699999,187694.42213600001]
["47000-BF_1.1.1.1","MAGDALENA",47000,"DEPARTAMENTO DEL MAGDALENA",4,"BF_1.1.1.1","             Vehículos Automotores",6671.7908340000004,6610.2763720000003]
["47000-BF_1.1.1.4","MAGDALENA",47000,"DEPARTAMENTO DEL MAGDALENA",7,"BF_1.1.1.4","             Registro y Anotación",16904.539923,11359.932564000001]
["47000-BF_1.1.1.5","MAGDALENA",47000,"DEPARTAMENTO DEL MAGDALENA",8,"BF_1.1.1.5","             Licores",22865.829719000001,28716.730255999999]
["47000-BF_1.1.1.6","MAGDALENA",47000,"DEPARTAMENTO DEL MAGDALENA",9,"BF_1.1.1.6","             Cerveza",78984.090314999994,59633.543167999997]
["47000-BF_1.1.1.7","MAGDALENA",47000,"DEPARTAMENTO DEL MAGDALENA",10,"BF_1.1.1.7","             Cigarrillos y Tabaco",10712.695411999999,8449.7057170000007]
["47000-BF_1.1.1.8","MAGDALENA",47000,"DEPARTAMENTO DEL MAGDALENA",11,"BF_1.1.1.8","             Sobretasa Consumo Gasolina Motor",9347.6949999999997,7730.4317339999998]
{"$rows_left_out":2290}
{"sheet":"DAF_Ley358","index":4,"n_rows":141,"n_cols":7,"rows_kept":141,"cut":false,"hidden":true,"merged":[]}
["CONCATENACION","DEPARTAMENTO","CODIGO_DIVIPOLA_ENTIDAD","NOMBRE_ENTIDAD","CODIGO_INDICADOR","NOMBRE_INDICADOR","TOTAL"]
[{"$f":"C2&\"-\"&E2","v":"47030-CAPEN.1.1"},"MAGDALENA",47030,"ALGARROBO","CAPEN.1.1","1.1 Ingresos corrientes (sin descontar vigencias futuras)",6282.4679232834997]
["47030-CAPEN.2","MAGDALENA",47030,"ALGARROBO","CAPEN.2","2. Gastos de funcionamiento",2150.5070890000002]
["47030-CAPEN.4.1.1","MAGDALENA",47030,"ALGARROBO","CAPEN.4.1.1","4.1.1 Saldo de la deuda",1170.41662]
["47030-CAPEN.4.2.1","MAGDALENA",47030,"ALGARROBO","CAPEN.4.2.1","4.2.1 Amortizaciones de la deuda",1170.41662]
["47030-CAPEN.5.1","MAGDALENA",47030,"ALGARROBO","CAPEN.5.1","5.1 Intereses de la deuda",200]
[{"$f":"C7&\"-\"&E7","v":"47053-CAPEN.1.1"},"MAGDALENA",47053,"ARACATACA","CAPEN.1.1","1.1 Ingresos corrientes (sin descontar vigencias futuras)",10309.081350478]
["47053-CAPEN.1.2","MAGDALENA",47053,"ARACATACA","CAPEN.1.2","1.2 Vigencias futuras",422.97899999999998]
["47053-CAPEN.2","MAGDALENA",47053,"ARACATACA","CAPEN.2","2. Gastos de funcionamiento",3302.2741470000001]
["47053-CAPEN.4.1.1","MAGDALENA",47053,"ARACATACA","CAPEN.4.1.1","4.1.1 Saldo de la deuda",4947.9166670000004]
{"$rows_left_out":132}
{"sheet":"DAF_SaldoDeuda","index":5,"n_rows":25,"n_cols":4,"rows_kept":25,"cut":false,"hidden":true,"merged":[]}
["DEPARTAMENTO","CODIGO_DIVIPOLA_ENTIDAD","NOMBRE_ENTIDAD","SALDO"]
["MAGDALENA",47030,"ALGARROBO",1170.4169999999999]
["MAGDALENA",47053,"ARACATACA",4947.9170000000004]
["MAGDALENA",47058,"ARIGUANÍ",1599.9269999999999]
["MAGDALENA",47161,"CERRO DE SAN ANTONIO",750.69299999999998]
["MAGDALENA",47189,"CIÉNAGA",3700]
["MAGDALENA",47205,"CONCORDIA - MAGDALENA",1827.9280000000001]
["MAGDALENA",47000,"DEPARTAMENTO DEL MAGDALENA",74280]
["MAGDALENA",47245,"EL BANCO",6247.018]
["MAGDALENA",47268,"EL RETÉN",2970]
{"$rows_left_out":16}
{"sheet":"Entidad","index":6,"n_rows":19,"n_cols":2,"rows_kept":19,"cut":false,"hidden":false,"merged":[[2,0,2,1],[4,0,5,2],[18,0,18,2]]}
[]
[]
[]
[]
["FORMULACION PLAN FINANCIERO DEL MARCO FISCAL DE MEDIANO PLAZO"]
[]
[]
["Departamento:",{"$f":"DatosBasicos!B2","v":"MAGDALENA"}]
[]
["Entidad Territorial:","DEPARTAMENTO DEL MAGDALENA"]
{"$rows_left_out":10}
{"sheet":"Descripción Glosario","index":7,"n_rows":44,"n_cols":3,"rows_kept":44,"cut":false,"hidden":false,"merged":[[24,2,24,9],[25,2,25,9],[26,2,26,9],[21,2,21,9],[22,2,22,9],[23,2,23,9],[2,0,2,10],[8,1,8,10],[18,2,18,9],[19,2,19,9],[20,2,20,9],[10,1,10,10],[11,1,11,10],[12,1,12,10],[13,1,13,10],[14,1,14,10],[5,1,5,10],[7,1,7,10],[6,1,6,10],[9,1,9,10],[15,1,15,10],[32,2,32,9],[33,2,33,9],[34,2,34,9],[35,2,35,9],[36,2,36,9],[27,2,27,9],[28,2,28,9],[29,2,29,9],[30,2,30,9],[31,2,31,9],[42,2,42,9],[43,2,43,9],[37,2,37,9],[38,2,38,9],[39,2,39,9],[40,2,40,9],[41,2,41,9]]}
[]
[]
["Herramienta: Plan Financiero"]
[]
["1. Descripción Estructura de la Herramienta:"]
[null,"Hoja \"Histórico Deptos\" = Estructura del Plan Financiero formulado por el DNP que contiene la información de ingresos y gastos de las últimas cuatro (4) vigencias para el Departamento. Esta información permite evaluar las variaciones y composiciones y tomar estos datos como referencia para las proyecciones."]
[null,"Hoja \"Histórico Mpios\" = Estructura del Plan Financiero formulado por el DNP que contiene la información de ingresos y gastos de las últimas cuatro (4) vigencias para Municipios. Esta información permite evaluar las variaciones y composiciones y tomar estos datos como referencia para las proyecciones."]
[null,"Hoja \"Restricciones_Pptales_ET\" = Relación de las Restricciones Presupuestales de la Entidad Territorial, derivadas de la Ejecución de Programas de Saneamiento Fiscal, la aprobación de Vigencias Futuras, la existencia de pasivos ciertos y exigibles de vigencias anteriores y la determinación de los pasivos contingentes. Incluye la determinación de Ingresos Corrientes de Libre Destinación y límites del gasto."]
[null,"Hoja \"Ingresos\" = Contiene la información del Presupuesto Definitivo y los Recaudos de la Entidad Territorial, con corte al mes de Marzo de la vigencia, reportados a través del FUT.  La columna H de la hoja permite digitar, en cada una de las celdas resaltadas en amarillo, los valores proyectados de los recaudos que se obtendrán por cada concepto entre el mes de abril y diciembre de la vigencia. En la columna I se obtiene el total del ingreso proyectado para la vigencia. Finalmente, la columna J permite digitar, en cada una de las celdas resaltadas en amarillo, los valores del proyecto de presupuesto de ingresos para cada concepto en la siguiente vigencia."]
[null,"Hoja \"Gastos\" = Contiene la información del Presupuesto Definitivo y los Compromisos de la Entidad Territorial, con corte al mes de Marzo de la vigencia, reportados a través del FUT.  La columna E de la hoja permite digitar, en cada una de las celdas resaltadas en amarillo, los valores de los compromisos que se proyectan adquirir por cada concepto entre el mes de abril y diciembre de la vigencia. En la columna I se obtiene el total de los compromisos proyectados para la vigencia. Finalmente, la columna G permite digitar, en cada una de las celdas resaltadas en amarillo, los valores del proyecto de presupuesto de gastos para cada concepto en la siguiente vigencia."]
{"$rows_left_out":35}
{"sheet":"Supuestos Macro Nación","index":8,"n_rows":115,"n_cols":18,"rows_kept":115,"cut":false,"hidden":false,"merged":[[70,4,70,17],[77,4,77,17],[0,1,0,2],[3,4,3,17],[10,4,10,17],[20,4,20,17],[31,4,31,17],[35,4,35,17],[41,4,41,17],[55,0,55,3],[60,0,60,3],[65,0,65,3],[55,4,55,17],[60,4,60,17],[65,4,65,17],[70,0,70,3],[77,0,77,3],[1,0,1,3],[3,0,3,3],[10,0,10,3],[20,0,20,3],[31,0,31,3],[35,0,35,3],[41,0,41,3]]}
[null,"Fecha:",null,"2021-06-03"]
["SUPUESTOS GENERALES BASICOS",null,null,null,2019,2020,2021,2022,2023,2024,2025,2026,2027,2028,2029,2030,2031,2032]
[]
["INFLACION"]
[]
[null,"INFLACION DOMESTICA"]
[null,"   IPC fin de período",null,null,3.8,1.61,3,2.8,3,3,3,3,3,3,3,3,3,3]
[null,"INFLACIÓN USA"]
[null,"   IPC fin de período",null,null,1.8,1.3,2.2999999999999998,2.4,2,2,2,2,2,2,2,2,2,2]
[]
{"$rows_left_out":106}
{"sheet":"Plan Financiero","index":9,"n_rows":127,"n_cols":18,"rows_kept":127,"cut":false,"hidden":false,"merged":[[0,2,0,3],[1,2,1,3],[2,2,2,3]]}
[null,null,"BALANCE FINANCIERO DEPARTAMENTO"]
[null,null,{"$f":"+Entidad!B10","v":"DEPARTAMENTO DEL MAGDALENA"}]
[null,null,"Valores en millones de pesos"]
["Tipo","Categoría FUT","Cuenta","Descripción",{"$f":"VALUE(DatosBasicos!A2)-2","v":2019},{"$f":"E4+1","v":2020},{"$f":"F4+1","v":2021},2022,2023,2024,2025,2026,2027,2028,2029,2030,2031,{"$f":"Q4+1","v":2032}]
["P","NA","BF_1","INGRESOS TOTALES",{"$f":"E6+E75","v":1029084.1525279999},1030817.15071,{"$f":"G6+G75","v":1118131.5145009898},1167208.8665898554,1224491.3759757983,1259834.7972356204,1322614.844918824,1388622.244984702,1458028.5114877629,1531014.6015072712,1607771.4542440474,1688500.5619997471,{"$f":"Q6+Q75","v":1773414.5749865475},{"$f":"R6+R75","v":1862737.942037621}]
["P","NA","BF_1.1","    INGRESOS CORRIENTES",{"$f":"E7+E20+E23","v":974549.37596099998},968351.98533699999,{"$f":"G7+G20+G23","v":1073048.3160679899},1121276.9118856052,1177430.7030833783,1236473.7198275034,1298559.3244143825,1363849.3036600826,1432514.3485101587,1504734.5619305628,1580699.9968026709,1660611.2256534833,{"$f":"Q7+Q20+Q23","v":1744679.9441670566},{"$f":"R7+R20+R23","v":1833129.6105455863}]
["P","NA","BF_1.1.1","        TRIBUTARIOS",{"$f":"SUM(E8:E19)","v":205644.25159699999},187694.42213600001,{"$f":"SUM(G8:G19)","v":215192.87538606933},223294.99278754651,235576.21739086148,248532.90934735886,262202.21936146362,276623.34142634406,291837.625204793,307888.69459105656,324822.5727935647,342687.81429721072,{"$f":"SUM(Q8:Q19)","v":361535.6440835573},{"$f":"SUM(R8:R19)","v":381420.10450815293}]
["H","INGRESOS","BF_1.1.1.1","             Vehículos Automotores",{"$f":"IFERROR(VLOOKUP(Entidad!$B$12&\"-\"&'Plan Financiero'!$C8,DAF_BalanceFinanciero!$A$2:$I$2299,COLUMN(DAF_BalanceFinanciero!H$1),FALSE),0)","v":6671.7908340000004},{"$f":"IFERROR(VLOOKUP(Entidad!$B$12&\"-\"&'Plan Financiero'!$C8,DAF_BalanceFinanciero!$A$2:$I$2299,COLUMN(DAF_BalanceFinanciero!I$1),FALSE),0)","v":6610.2763720000003},8301.8855937999997,8756.1647734927355,9237.7538360348353,9745.8302970167515,10281.850963352672,10847.352766337068,11443.957168485606,12073.374812752312,12737.410427453689,13437.968000963641,14177.05624101664,14956.794334272554]
["H","INGRESOS","BF_1.1.1.2","             Impuesto Predial Unificado",{"$f":"IFERROR(VLOOKUP(Entidad!$B$12&\"-\"&'Plan Financiero'!$C9,DAF_BalanceFinanciero!$A$2:$I$2299,COLUMN(DAF_BalanceFinanciero!H$1),FALSE),0)","v":0},{"$f":"IFERROR(VLOOKUP(Entidad!$B$12&\"-\"&'Plan Financiero'!$C9,DAF_BalanceFinanciero!$A$2:$I$2299,COLUMN(DAF_BalanceFinanciero!I$1),FALSE),0)","v":0},null,null,0,0,0,0,0,0,0,0,0,0]
["H","INGRESOS","BF_1.1.1.3","             Impuesto de Industria y Comercio",{"$f":"IFERROR(VLOOKUP(Entidad!$B$12&\"-\"&'Plan Financiero'!$C10,DAF_BalanceFinanciero!$A$2:$I$2299,COLUMN(DAF_BalanceFinanciero!H$1),FALSE),0)","v":0},{"$f":"IFERROR(VLOOKUP(Entidad!$B$12&\"-\"&'Plan Financiero'!$C10,DAF_BalanceFinanciero!$A$2:$I$2299,COLUMN(DAF_BalanceFinanciero!I$1),FALSE),0)","v":0},null,null,0,0,0,0,0,0,0,0,0,0]
{"$rows_left_out":118}
{"sheet":"Superávit Primario","index":10,"n_rows":14,"n_cols":15,"rows_kept":14,"cut":false,"hidden":false,"merged":[]}
[{"$f":"Entidad!B10","v":"DEPARTAMENTO DEL MAGDALENA"}]
["METAS DEL SUPERAVIT PRIMARIO"]
["LEY 819 DE 2003 (millones de pesos)"]
["CONCEPTOS",{"$f":"+'Plan Financiero'!E4","v":2019},{"$f":"+'Plan Financiero'!F4","v":2020},{"$f":"+'Plan Financiero'!G4","v":2021},{"$f":"+'Plan Financiero'!H4","v":2022},{"$f":"+'Plan Financiero'!I4","v":2023},{"$f":"+'Plan Financiero'!J4","v":2024},{"$f":"+'Plan Financiero'!K4","v":2025},{"$f":"+'Plan Financiero'!L4","v":2026},{"$f":"+'Plan Financiero'!M4","v":2027},{"$f":"+'Plan Financiero'!N4","v":2028},{"$f":"+'Plan Financiero'!O4","v":2029},{"$f":"+'Plan Financiero'!P4","v":2030},{"$f":"+'Plan Financiero'!Q4","v":2031},{"$f":"+'Plan Financiero'!R4","v":2032}]
["INGRESOS CORRIENTES",{"$f":"+'Plan Financiero'!E6","v":974549.37596099998},{"$f":"+'Plan Financiero'!F6","v":968351.98533699999},{"$f":"+'Plan Financiero'!G6","v":1073048.3160679899},{"$f":"+'Plan Financiero'!H6","v":1121276.9118856052},{"$f":"+'Plan Financiero'!I6","v":1177430.7030833783},{"$f":"+'Plan Financiero'!J6","v":1236473.7198275034},{"$f":"+'Plan Financiero'!K6","v":1298559.3244143825},{"$f":"+'Plan Financiero'!L6","v":1363849.3036600826},{"$f":"+'Plan Financiero'!M6","v":1432514.3485101587},{"$f":"+'Plan Financiero'!N6","v":1504734.5619305628},{"$f":"+'Plan Financiero'!O6","v":1580699.9968026709},{"$f":"+'Plan Financiero'!P6","v":1660611.2256534833},{"$f":"+'Plan Financiero'!Q6","v":1744679.9441670566},{"$f":"+'Plan Financiero'!R6","v":1833129.6105455863}]
["RECURSOS DE CAPITAL",{"$f":"+'Plan Financiero'!E75+'Plan Financiero'!E106","v":280387.39129399997},{"$f":"+'Plan Financiero'!F75+'Plan Financiero'!F106","v":244649.74170499999},{"$f":"+'Plan Financiero'!G75+'Plan Financiero'!G106","v":255554.81094623002},{"$f":"+'Plan Financiero'!H75+'Plan Financiero'!H106","v":47431.954704250165},{"$f":"+'Plan Financiero'!I75+'Plan Financiero'!I106","v":47060.672892420174},{"$f":"+'Plan Financiero'!J75+'Plan Financiero'!J106","v":23361.07740811698},{"$f":"+'Plan Financiero'!K75+'Plan Financiero'!K106","v":24055.520504441658},{"$f":"+'Plan Financiero'!L75+'Plan Financiero'!L106","v":24772.941324619329},{"$f":"+'Plan Financiero'!M75+'Plan Financiero'!M106","v":25514.162977604101},{"$f":"+'Plan Financiero'!N75+'Plan Financiero'!N106","v":26280.039576708266},{"$f":"+'Plan Financiero'!O75+'Plan Financiero'!O106","v":27071.457441376599},{"$f":"+'Plan Financiero'!P75+'Plan Financiero'!P106","v":27889.336346263663},{"$f":"+'Plan Financiero'!Q75+'Plan Financiero'!Q106","v":28734.630819490849},{"$f":"+'Plan Financiero'!R75+'Plan Financiero'!R106","v":29608.33149203466}]
["GASTOS DE FUNCIONAMIENTO",{"$f":"+'Plan Financiero'!E49","v":165280.02598999999},{"$f":"+'Plan Financiero'!F49","v":150924.19624799999},{"$f":"+'Plan Financiero'!G49","v":185425.68464261439},{"$f":"+'Plan Financiero'!H49","v":191017.31758781342},{"$f":"+'Plan Financiero'!I49","v":199036.51121666838},{"$f":"+'Plan Financiero'!J49","v":182594.711187359},{"$f":"+'Plan Financiero'!K49","v":190656.38565917779},{"$f":"+'Plan Financiero'!L49","v":199388.00195928852},{"$f":"+'Plan Financiero'!M49","v":208626.1800447407},{"$f":"+'Plan Financiero'!N49","v":218149.30582481273},{"$f":"+'Plan Financiero'!O49","v":228012.25586884533},{"$f":"+'Plan Financiero'!P49","v":238446.10038992969},{"$f":"+'Plan Financiero'!Q49","v":249496.11378645757},{"$f":"+'Plan Financiero'!R49","v":260331.33841022596}]
["GASTOS DE INVERSION",{"$f":"+'Plan Financiero'!E65+'Plan Financiero'!E87+SUM('Plan Financiero'!E63:E64)","v":946306.22860700008},{"$f":"+'Plan Financiero'!F65+'Plan Financiero'!F87+SUM('Plan Financiero'!F63:F64)","v":819766.01215199998},{"$f":"+'Plan Financiero'!G65+'Plan Financiero'!G87+SUM('Plan Financiero'!G63:G64)","v":1038791.5060948998},{"$f":"+'Plan Financiero'!H65+'Plan Financiero'!H87+SUM('Plan Financiero'!H63:H64)","v":957771.48787354026},{"$f":"+'Plan Financiero'!I65+'Plan Financiero'!I87+SUM('Plan Financiero'!I63:I64)","v":958515.43723987846},{"$f":"+'Plan Financiero'!J65+'Plan Financiero'!J87+SUM('Plan Financiero'!J63:J64)","v":963981.79260977334},{"$f":"+'Plan Financiero'!K65+'Plan Financiero'!K87+SUM('Plan Financiero'!K63:K64)","v":1008510.4592621491},{"$f":"+'Plan Financiero'!L65+'Plan Financiero'!L87+SUM('Plan Financiero'!L63:L64)","v":1057688.7256013064},{"$f":"+'Plan Financiero'!M65+'Plan Financiero'!M87+SUM('Plan Financiero'!M63:M64)","v":1109457.3822145662},{"$f":"+'Plan Financiero'!N65+'Plan Financiero'!N87+SUM('Plan Financiero'!N63:N64)","v":1157979.0430470274},{"$f":"+'Plan Financiero'!O65+'Plan Financiero'!O87+SUM('Plan Financiero'!O63:O64)","v":1208794.17257321},{"$f":"+'Plan Financiero'!P65+'Plan Financiero'!P87+SUM('Plan Financiero'!P63:P64)","v":1261963.9784094691},{"$f":"+'Plan Financiero'!Q65+'Plan Financiero'!Q87+SUM('Plan Financiero'!Q63:Q64)","v":1317378.7362829896},{"$f":"+'Plan Financiero'!R65+'Plan Financiero'!R87+SUM('Plan Financiero'!R63:R64)","v":1375120.0193622103}]
["SUPERAVIT O DEFICIT PRIMARIO",{"$f":"+B5+B6-B7-B8","v":143350.51265799976},242311.51864200004,{"$f":"+D5+D6-D7-D8","v":104385.93627670582},19920.06112850178,66939.427519251476,113258.29343848815,123447.99999749719,131545.51742410706,139944.94922845601,154886.25263543101,170965.02580199204,188090.48320034822,{"$f":"+N5+N6-N7-N8","v":206539.72491710028},227286.58426518482]
["INDICADOR (superávit primario / Intereses) > = 100%",{"$f":"IF(B14<>0,B9/(B14),IF(AND(B14=0,B9<0),0,0))","v":134.19686090278287},{"$f":"IF(C14<>0,C9/(C14),IF(AND(C14=0,C9<0),0,0))","v":93.842055793315836},26.256359028897755,3.1560835799040952,11.372355836273384,22.327875264259362,30.815010350963334,44.865121163071883,74.530739719168096,124.09397451852925,276.37741649418308,0,{"$f":"IF(N14<>0,N9/(N14),IF(AND(N14=0,N9<0),0,0))","v":0},0]
{"$rows_left_out":5}
{"sheet":"Capacidad de Endeudamiento","index":11,"n_rows":52,"n_cols":14,"rows_kept":52,"cut":false,"hidden":false,"merged":[[0,1,0,2],[1,1,1,2],[2,1,2,2],[2,3,2,13]]}
[null,"REFERENTE DE LA CAPACIDAD DE ENDEUDAMIENTO",null,"IPC PROYECTADO"]
[null,{"$f":"Entidad!B10","v":"DEPARTAMENTO DEL MAGDALENA"},null,0.03,{"$f":"D2","v":0.03},{"$f":"E2","v":0.03},0.03,0.03,0.03,0.03,0.03,0.03,0.03,0.03]
[null,"Valores en millones de pesos",null,"PROYECCION CAPACIDAD LEGAL DE ENDEUDAMIENTO - LEY 358 DE 1997"]
[null,"Concepto",{"$f":"\"Capacidad de endeudamiento (Ley 358/97)       \"&Entidad!B14","v":"Capacidad de endeudamiento (Ley 358/97)       2021"},{"$f":"+Entidad!B14+1","v":2022},{"$f":"+D4+1","v":2023},{"$f":"+E4+1","v":2024},2025,2026,2027,2028,2029,2030,2031,2032]
[null,"1. Ingresos corrientes Ley 358 de 1997 (1.1-1.2)",{"$f":"C6-C7","v":324312.29464199999},{"$f":"D6-D7","v":330372.63728145999},340754.60378055676,350751.2892567559,361037.70742856618,371622.09272276558,382512.90600900137,393718.84046652913,405248.82758525939,417112.04330326454,429317.91428288002,{"$f":"N6-N7","v":441876.12432750722}]
["CAPEN.1.1","    1.1 Ingresos corrientes (sin descontar vigencias futuras)",{"$f":"IFERROR(VLOOKUP(Entidad!$B$12&\"-\"&'Capacidad de Endeudamiento'!$A6,DAF_Ley358!$A$2:$G$141,7,FALSE),0)","v":335392.69764199998},{"$f":"+C6*(1+D2)","v":345454.47857126},{"$f":"+D6*(1+E2)","v":355818.11292839778},366492.65631624975,377487.43600573723,388812.05908590934,400476.42085848661,412490.71348424122,424865.43488876848,437611.39793543157,450739.73987349455,464261.9320696994]
["CAPEN.1.2","    1.2 Vigencias futuras",{"$f":"IFERROR(VLOOKUP(Entidad!$B$12&\"-\"&'Capacidad de Endeudamiento'!$A7,DAF_Ley358!$A$2:$G$141,7,FALSE),0)","v":11080.403},{"$f":"'Plan Financiero'!H37+667","v":15081.841289800001},{"$f":"'Plan Financiero'!I37","v":15063.509147841},{"$f":"'Plan Financiero'!J37","v":15741.367059493843},{"$f":"'Plan Financiero'!K37","v":16449.728577171063},{"$f":"'Plan Financiero'!L37","v":17189.966363143762},{"$f":"'Plan Financiero'!M37","v":17963.514849485229},{"$f":"'Plan Financiero'!N37","v":18771.873017712063},{"$f":"'Plan Financiero'!O37","v":19616.607303509103},{"$f":"'Plan Financiero'!P37","v":20499.354632167011},{"$f":"'Plan Financiero'!Q37","v":21421.825590614524},{"$f":"'Plan Financiero'!R37","v":22385.807742192177}]
["CAPEN.2","2. Gastos de funcionamiento",{"$f":"IFERROR(VLOOKUP(Entidad!$B$12&\"-\"&'Capacidad de Endeudamiento'!$A8,DAF_Ley358!$A$2:$G$141,7,FALSE),0)","v":100856.15496699999},{"$f":"+C8*(1+D2)","v":103881.83961600999},{"$f":"+D8*(1+E2)","v":106998.2948044903},110208.24364862501,113514.49095808376,116919.92568682627,120427.52345743106,124040.34916115399,127761.55963598861,131594.40642506827,135542.23861782032,139608.50577635493]
[null,"3. Ahorro operacional (1-2)",{"$f":"C5-C8","v":223456.13967499998},{"$f":"D5-D8","v":226490.79766544999},233756.30897606647,240543.04560813089,247523.21647048241,254702.16703593929,262085.38255157031,269678.49130537512,277487.26794927078,285517.63687819627,293775.67566505971,{"$f":"N5-N8","v":302267.61855115229}]
[null,"4. Saldo neto de la deuda con nuevo crédito (4.1-4.2-4.3+4.4)",{"$f":"C11-C16-C20+C21","v":68715.941128000006},105557.06277700001,92398.184426000022,70905.972741666686,50763.761045333355,34485.608184000026,22990.457123666696,11495.306063333364,0.15500600003178988,0.15500600003178988,0.15500600003178988,{"$f":"N11-N16-N20+N21","v":0.15500600003178988}]
{"$rows_left_out":42}